nix-store-2.35.2+2
checks.x86_64-linux.nixos-renoir
· build #3
· raw
unpackPhase
1unpacking source archive /nix/store/lxzah00bymzhk3fshs6xy9jxjm8pmx4s-source-patched-source2source root is source-patched-source/./src/libstore3separate-debug-info: recording checksum of source files for debug support...configurePhase
4mesonConfigurePhase flags: --prefix=/nix/store/i406k0a5y90rcdpjk4hi2b65j3slzd1j-nix-store-2.35.2+2 --libdir=/nix/store/i406k0a5y90rcdpjk4hi2b65j3slzd1j-nix-store-2.35.2+2/lib --libexecdir=/nix/store/i406k0a5y90rcdpjk4hi2b65j3slzd1j-nix-store-2.35.2+2/libexec --bindir=/nix/store/i406k0a5y90rcdpjk4hi2b65j3slzd1j-nix-store-2.35.2+2/bin --sbindir=/nix/store/i406k0a5y90rcdpjk4hi2b65j3slzd1j-nix-store-2.35.2+2/sbin --includedir=/nix/store/k1lc270dsl83hmml7xmwpv5ydbrd03cg-nix-store-2.35.2+2-dev/include --mandir=/nix/store/i406k0a5y90rcdpjk4hi2b65j3slzd1j-nix-store-2.35.2+2/share/man --infodir=/nix/store/i406k0a5y90rcdpjk4hi2b65j3slzd1j-nix-store-2.35.2+2/share/info --localedir=/nix/store/i406k0a5y90rcdpjk4hi2b65j3slzd1j-nix-store-2.35.2+2/share/locale -Dauto_features=enabled -Dwrap_mode=nodownload --buildtype=release -Dseccomp-sandboxing=enabled -Dembedded-sandbox-shell=false -Ds3-aws-auth=enabled -Dsandbox-shell=/nix/store/zqx4fc1wiybdwxx9aq06knqpak54hzaf-busybox-1.37.0/bin/busybox -Db_lto=true5The Meson build system6Version: 1.10.27Source dir: /build/source-patched-source/src/libstore8Build dir: /build/source-patched-source/src/libstore/build9Build type: native build10Project name: nix-store11Project version: 2.35.2+212C++ compiler for the host machine: g++ (gcc 15.3.0 "g++ (GCC) 15.3.0")13C++ linker for the host machine: g++ ld.bfd 2.4614Host machine cpu family: x86_6415Host machine cpu: x86_6416Found pkg-config: YES (/nix/store/29d1c5xk6w3rwl7yvdfwl90whslv5h54-pkg-config-wrapper-0.29.2/bin/pkg-config) 0.29.217Run-time dependency nix-util found: YES 2.35.2+218Program ln found: YES (/nix/store/xjl7p8dvyk2j53kqf7f43kdj4ypbxz7g-coreutils-9.11/bin/ln)19Checking for function "posix_fallocate" : YES 20Checking for function "statvfs" : YES 21Checking for function "open_tree" : YES 22Checking for function "move_mount" : YES 23Has header "linux/landlock.h" : YES 24Has header "sys/xattr.h" : YES 25Checking for function "llistxattr" : YES 26Checking for function "lremovexattr" : YES 27Run-time dependency Boost (found: container, url) found: YES 1.89.028Run-time dependency libcurl found: YES 8.22.029Run-time dependency libseccomp found: YES 2.6.130Run-time dependency nlohmann_json found: YES 3.12.031Run-time dependency sqlite3 found: YES 3.53.332Found CMake: /nix/store/c3bm9h7k398cmg00d4rss6hcxkl2zbl2-cmake-4.4.2/bin/cmake (4.4.2)33Run-time dependency aws-crt-cpp (modules: AWS::aws-crt-cpp) found: YES 0.34.334Program bash found: YES (/nix/store/svx59425zxp552p2b8gm11qj5r09b56i-bash-5.3p15/bin/bash)35Program /nix/store/zqx4fc1wiybdwxx9aq06knqpak54hzaf-busybox-1.37.0/bin/busybox found: YES (/nix/store/zqx4fc1wiybdwxx9aq06knqpak54hzaf-busybox-1.37.0/bin/busybox)36Program lsof found: NO37Configuring store-config-private.hh using configuration38Run-time dependency threads found: YES39Compiler for C++ supports arguments -Wdeprecated-copy: YES 40Compiler for C++ supports arguments -Werror=suggest-override: YES 41Compiler for C++ supports arguments -Werror=switch: YES 42Compiler for C++ supports arguments -Werror=switch-enum: YES 43Compiler for C++ supports arguments -Werror=undef: YES 44Compiler for C++ supports arguments -Werror=unused-result: YES 45Compiler for C++ supports arguments -Werror=sign-compare: YES 46Compiler for C++ supports arguments -Werror=return-type: YES 47Compiler for C++ supports arguments -Werror=non-virtual-dtor: YES 48Compiler for C++ supports arguments -Wignored-qualifiers: YES 49Compiler for C++ supports arguments -Wimplicit-fallthrough: YES 50Compiler for C++ supports arguments -Wno-deprecated-declarations: YES 51Compiler for C++ supports arguments -Wno-interference-size: YES 52Compiler for C++ supports arguments -Wno-subobject-linkage: YES 53Compiler for C++ supports arguments -Werror=c99-designator: NO 54Compiler for C++ supports arguments -Werror=weak-vtables: NO 55Checking if "using libstdc++" compiles: YES 56Checking if "linker can wrap __assert_fail" links: YES 57Program python3 found: YES58Program run-clang-tidy found: NO59Run-time dependency nix-clang-tidy found: NO (tried pkgconfig and cmake)60Configuring config.hh using configuration61Found pkg-config: YES (/nix/store/29d1c5xk6w3rwl7yvdfwl90whslv5h54-pkg-config-wrapper-0.29.2/bin/pkg-config) 0.29.262Build targets in project: 16364nix-store 2.35.2+26566 can hardlink to symlink: YES6768 User defined options69 auto_features : enabled70 b_lto : true71 bindir : /nix/store/i406k0a5y90rcdpjk4hi2b65j3slzd1j-nix-store-2.35.2+2/bin72 buildtype : release73 embedded-sandbox-shell : false74 includedir : /nix/store/k1lc270dsl83hmml7xmwpv5ydbrd03cg-nix-store-2.35.2+2-dev/include75 infodir : /nix/store/i406k0a5y90rcdpjk4hi2b65j3slzd1j-nix-store-2.35.2+2/share/info76 libdir : /nix/store/i406k0a5y90rcdpjk4hi2b65j3slzd1j-nix-store-2.35.2+2/lib77 libexecdir : /nix/store/i406k0a5y90rcdpjk4hi2b65j3slzd1j-nix-store-2.35.2+2/libexec78 localedir : /nix/store/i406k0a5y90rcdpjk4hi2b65j3slzd1j-nix-store-2.35.2+2/share/locale79 mandir : /nix/store/i406k0a5y90rcdpjk4hi2b65j3slzd1j-nix-store-2.35.2+2/share/man80 prefix : /nix/store/i406k0a5y90rcdpjk4hi2b65j3slzd1j-nix-store-2.35.2+281 s3-aws-auth : enabled82 sandbox-shell : /nix/store/zqx4fc1wiybdwxx9aq06knqpak54hzaf-busybox-1.37.0/bin/busybox83 sbindir : /nix/store/i406k0a5y90rcdpjk4hi2b65j3slzd1j-nix-store-2.35.2+2/sbin84 seccomp-sandboxing : enabled85 wrap_mode : nodownload8687Found ninja-1.13.2 at /nix/store/r8a159fqvj0mpczq0dq8d3dwdd2rsz8c-ninja-1.13.2/bin/ninja88Running postconf script '/nix/store/d64q19q1xjdwfhqx6czvrjgrhq0n3lcc-python3-3.14.7/bin/python3.14 /build/source-patched-source/src/libstore/nix-meson-build-support/common/clang-tidy/clean_compdb.py /build/source-patched-source/src/libstore/build/compile_commands.json /build/source-patched-source/src/libstore/build/nix-meson-build-support/common/clang-tidy/compile_commands.json'buildPhase
89build flags: -j1690[1/93] Generating 'libnixstore.so.2.35.2.p/schema.sql.gen.hh'91[2/93] Generating 'libnixstore.so.2.35.2.p/ca-specific-schema.sql.gen.hh'92[3/93] Compiling C++ object libnixstore.so.2.35.2.p/build_build-log.cc.o93[4/93] Compiling C++ object libnixstore.so.2.35.2.p/build_drv-output-substitution-goal.cc.o94[5/93] Compiling C++ object libnixstore.so.2.35.2.p/builtins_buildenv.cc.o95[6/93] Compiling C++ object libnixstore.so.2.35.2.p/build_goal.cc.o96[7/93] Compiling C++ object libnixstore.so.2.35.2.p/build_derivation-env-desugar.cc.o97[8/93] Compiling C++ object libnixstore.so.2.35.2.p/build_substitution-goal.cc.o98[9/93] Compiling C++ object libnixstore.so.2.35.2.p/build-result.cc.o99[10/93] Compiling C++ object libnixstore.so.2.35.2.p/build_derivation-check.cc.o100[11/93] Compiling C++ object libnixstore.so.2.35.2.p/build_derivation-goal.cc.o101[12/93] Compiling C++ object libnixstore.so.2.35.2.p/build_derivation-builder.cc.o102[13/93] Compiling C++ object libnixstore.so.2.35.2.p/build_worker.cc.o103[14/93] Compiling C++ object libnixstore.so.2.35.2.p/build_derivation-trampoline-goal.cc.o104[15/93] Compiling C++ object libnixstore.so.2.35.2.p/build_derivation-resolution-goal.cc.o105[16/93] Compiling C++ object libnixstore.so.2.35.2.p/build_entry-points.cc.o106[17/93] Compiling C++ object libnixstore.so.2.35.2.p/builtins_unpack-channel.cc.o107[18/93] Compiling C++ object libnixstore.so.2.35.2.p/common-protocol.cc.o108[19/93] Compiling C++ object libnixstore.so.2.35.2.p/builtins_fetchurl.cc.o109[20/93] Compiling C++ object libnixstore.so.2.35.2.p/common-ssh-store-config.cc.o110[21/93] Compiling C++ object libnixstore.so.2.35.2.p/build_derivation-building-goal.cc.o111[22/93] Compiling C++ object libnixstore.so.2.35.2.p/content-address.cc.o112[23/93] Compiling C++ object libnixstore.so.2.35.2.p/export-import.cc.o113[24/93] Compiling C++ object libnixstore.so.2.35.2.p/derived-path-map.cc.o114[25/93] Compiling C++ object libnixstore.so.2.35.2.p/binary-cache-store.cc.o115FAILED: [code=1] libnixstore.so.2.35.2.p/binary-cache-store.cc.o 116g++ -Ilibnixstore.so.2.35.2.p -I. -I.. -Iinclude -I../include -I../linux/build -Ilinux/include -I../linux/include -I../unix/build -Iunix/include -I../unix/include -I/nix/store/pq68n79v50vyghxj61prkc1rnjqyfwkz-nix-util-2.35.2+2-dev/include -I/nix/store/hq8zqc1b5y0llk0h278b2vv2gxrz9mr5-libarchive-3.8.9-dev/include -I/nix/store/hl8ixlmpd3qzdqd0xy0j6rl665fgb2wy-nlohmann_json-3.12.0/include -I/nix/store/5ca54qw9hzpc1f3dk5x3c9cg3bdb93iv-curl-8.22.0-dev/include -I/nix/store/xzhm91yf0cqz8cwzvsqzbd574gphjirw-libseccomp-2.6.1-dev/include -I/nix/store/yiinw6sm280sip2bap30f8aszi0lzvgr-sqlite-3.53.3-dev/include -I/nix/store/0lql2q28fmwpwcv8ixc0a56v62hf3714-aws-c-event-stream-0.7.0/include -I/nix/store/438197v8fi93r1vam02ghyv8x87x0xrg-aws-c-sdkutils-0.2.4/include -I/nix/store/4cvpkkzys8gjyvl8xkaii2fmddmdyzym-aws-c-mqtt-0.13.3/include -I/nix/store/4zarb13gjkgnzbb6apa5f0p8frhlh595-aws-c-compression-0.3.1/include -I/nix/store/6m0qxyj6cqfswysn178hfy5igyyiv036-aws-c-cal-0.9.2/include -I/nix/store/70nvgjb98z93s8ynbwhsnvahbgl8gpax-aws-c-common-0.12.4/include -I/nix/store/amh0q26qc53xk8msm4y7ywf0ixqqsw0z-aws-c-http-0.11.0/include -I/nix/store/axdpjqr4j5806ywa5h7p4dxihv74jnnx-aws-c-io-0.27.2/include -I/nix/store/hs576zc8gq2sfz97v209n275hkh8ls8p-aws-crt-cpp-0.34.3-dev/include -I/nix/store/k412a1r7x3p21d7l53sd9ja8xg7yhkas-aws-checksums-0.2.7/include -I/nix/store/mij14pdz6mld0xqg5c6s07mrhglwrz7r-openssl-3.6.4-dev/include -I/nix/store/xdl00qy5gi3kyqphw3w7q2y72m5drxvk-aws-c-s3-0.8.7/include -I/nix/store/z69s53jhf2mlmsnvn2b729whf25jnpwl-aws-c-auth-0.9.1/include -flto=auto -fdiagnostics-color=always -D_FILE_OFFSET_BITS=64 -Wall -Winvalid-pch -std=c++23 -O3 -Wdeprecated-copy -Werror=suggest-override -Werror=switch -Werror=switch-enum -Werror=undef -Werror=unused-result -Werror=sign-compare -Werror=return-type -Werror=non-virtual-dtor -Wignored-qualifiers -Wimplicit-fallthrough -Wno-deprecated-declarations -Wno-interference-size -Wno-subobject-linkage -D_GLIBCXX_USE_TBB_PAR_BACKEND=0 -fno-semantic-interposition -Wl,-Bsymbolic-functions -fPIC -DAWS_AUTH_USE_IMPORT_EXPORT -DAWS_CAL_USE_IMPORT_EXPORT -DAWS_CHECKSUMS_USE_IMPORT_EXPORT -DAWS_COMMON_USE_IMPORT_EXPORT -DAWS_COMPRESSION_USE_IMPORT_EXPORT -DAWS_CRT_CPP_USE_IMPORT_EXPORT -DAWS_ENABLE_EPOLL -DAWS_EVENT_STREAM_USE_IMPORT_EXPORT -DAWS_HTTP_USE_IMPORT_EXPORT -DAWS_IO_USE_IMPORT_EXPORT -DAWS_MQTT_USE_IMPORT_EXPORT -DAWS_S3_USE_IMPORT_EXPORT -DAWS_SDKUTILS_USE_IMPORT_EXPORT -DBOOST_CONTAINER_DYN_LINK=1 -DBOOST_ALL_NO_LIB -pthread -std=c++23 -MD -MQ libnixstore.so.2.35.2.p/binary-cache-store.cc.o -MF libnixstore.so.2.35.2.p/binary-cache-store.cc.o.d -o libnixstore.so.2.35.2.p/binary-cache-store.cc.o -c ../binary-cache-store.cc117g++: fatal error: Killed signal terminated program cc1plus118compilation terminated.119[26/93] Compiling C++ object libnixstore.so.2.35.2.p/downstream-placeholder.cc.o120[27/93] Compiling C++ object libnixstore.so.2.35.2.p/derivation-options.cc.o121FAILED: [code=1] libnixstore.so.2.35.2.p/derivation-options.cc.o 122g++ -Ilibnixstore.so.2.35.2.p -I. -I.. -Iinclude -I../include -I../linux/build -Ilinux/include -I../linux/include -I../unix/build -Iunix/include -I../unix/include -I/nix/store/pq68n79v50vyghxj61prkc1rnjqyfwkz-nix-util-2.35.2+2-dev/include -I/nix/store/hq8zqc1b5y0llk0h278b2vv2gxrz9mr5-libarchive-3.8.9-dev/include -I/nix/store/hl8ixlmpd3qzdqd0xy0j6rl665fgb2wy-nlohmann_json-3.12.0/include -I/nix/store/5ca54qw9hzpc1f3dk5x3c9cg3bdb93iv-curl-8.22.0-dev/include -I/nix/store/xzhm91yf0cqz8cwzvsqzbd574gphjirw-libseccomp-2.6.1-dev/include -I/nix/store/yiinw6sm280sip2bap30f8aszi0lzvgr-sqlite-3.53.3-dev/include -I/nix/store/0lql2q28fmwpwcv8ixc0a56v62hf3714-aws-c-event-stream-0.7.0/include -I/nix/store/438197v8fi93r1vam02ghyv8x87x0xrg-aws-c-sdkutils-0.2.4/include -I/nix/store/4cvpkkzys8gjyvl8xkaii2fmddmdyzym-aws-c-mqtt-0.13.3/include -I/nix/store/4zarb13gjkgnzbb6apa5f0p8frhlh595-aws-c-compression-0.3.1/include -I/nix/store/6m0qxyj6cqfswysn178hfy5igyyiv036-aws-c-cal-0.9.2/include -I/nix/store/70nvgjb98z93s8ynbwhsnvahbgl8gpax-aws-c-common-0.12.4/include -I/nix/store/amh0q26qc53xk8msm4y7ywf0ixqqsw0z-aws-c-http-0.11.0/include -I/nix/store/axdpjqr4j5806ywa5h7p4dxihv74jnnx-aws-c-io-0.27.2/include -I/nix/store/hs576zc8gq2sfz97v209n275hkh8ls8p-aws-crt-cpp-0.34.3-dev/include -I/nix/store/k412a1r7x3p21d7l53sd9ja8xg7yhkas-aws-checksums-0.2.7/include -I/nix/store/mij14pdz6mld0xqg5c6s07mrhglwrz7r-openssl-3.6.4-dev/include -I/nix/store/xdl00qy5gi3kyqphw3w7q2y72m5drxvk-aws-c-s3-0.8.7/include -I/nix/store/z69s53jhf2mlmsnvn2b729whf25jnpwl-aws-c-auth-0.9.1/include -flto=auto -fdiagnostics-color=always -D_FILE_OFFSET_BITS=64 -Wall -Winvalid-pch -std=c++23 -O3 -Wdeprecated-copy -Werror=suggest-override -Werror=switch -Werror=switch-enum -Werror=undef -Werror=unused-result -Werror=sign-compare -Werror=return-type -Werror=non-virtual-dtor -Wignored-qualifiers -Wimplicit-fallthrough -Wno-deprecated-declarations -Wno-interference-size -Wno-subobject-linkage -D_GLIBCXX_USE_TBB_PAR_BACKEND=0 -fno-semantic-interposition -Wl,-Bsymbolic-functions -fPIC -DAWS_AUTH_USE_IMPORT_EXPORT -DAWS_CAL_USE_IMPORT_EXPORT -DAWS_CHECKSUMS_USE_IMPORT_EXPORT -DAWS_COMMON_USE_IMPORT_EXPORT -DAWS_COMPRESSION_USE_IMPORT_EXPORT -DAWS_CRT_CPP_USE_IMPORT_EXPORT -DAWS_ENABLE_EPOLL -DAWS_EVENT_STREAM_USE_IMPORT_EXPORT -DAWS_HTTP_USE_IMPORT_EXPORT -DAWS_IO_USE_IMPORT_EXPORT -DAWS_MQTT_USE_IMPORT_EXPORT -DAWS_S3_USE_IMPORT_EXPORT -DAWS_SDKUTILS_USE_IMPORT_EXPORT -DBOOST_CONTAINER_DYN_LINK=1 -DBOOST_ALL_NO_LIB -pthread -std=c++23 -MD -MQ libnixstore.so.2.35.2.p/derivation-options.cc.o -MF libnixstore.so.2.35.2.p/derivation-options.cc.o.d -o libnixstore.so.2.35.2.p/derivation-options.cc.o -c ../derivation-options.cc123g++: fatal error: Killed signal terminated program cc1plus124compilation terminated.125[28/93] Compiling C++ object libnixstore.so.2.35.2.p/derived-path.cc.o126[29/93] Compiling C++ object libnixstore.so.2.35.2.p/indirect-root-store.cc.o127[30/93] Compiling C++ object libnixstore.so.2.35.2.p/derivations.cc.o128[31/93] Compiling C++ object libnixstore.so.2.35.2.p/daemon.cc.o129[32/93] Compiling C++ object libnixstore.so.2.35.2.p/local-binary-cache-store.cc.o130[33/93] Compiling C++ object libnixstore.so.2.35.2.p/local-fs-store.cc.o131[34/93] Compiling C++ object libnixstore.so.2.35.2.p/keys.cc.o132[35/93] Compiling C++ object libnixstore.so.2.35.2.p/gc.cc.o133[36/93] Compiling C++ object libnixstore.so.2.35.2.p/filetransfer.cc.o134[37/93] Compiling C++ object libnixstore.so.2.35.2.p/dummy-store.cc.o135[38/93] Compiling C++ object libnixstore.so.2.35.2.p/legacy-ssh-store.cc.o136[39/93] Compiling C++ object libnixstore.so.2.35.2.p/http-binary-cache-store.cc.o137[40/93] Compiling C++ object libnixstore.so.2.35.2.p/globals.cc.o138ninja: build stopped: subcommand failed.